Target
G-protein coupled receptor 55
Ligand
BDBM76068
Substrate
Meas. Tech.
SAR Analysis of Selective Antagonists of GPR55 using an Image-Based Assay - Set 4
IC50
>32000±n/a nM
Citation
 PubChem, PC SAR Analysis of Selective Antagonists of GPR55 using an Image-Based Assay - Set 4 PubChem Bioassay (2010)[AID] 
Target
Name:
G-protein coupled receptor 55
Synonyms:
G protein-coupled receptor 55 GPR55_HUMAN
Type:
PROTEIN
Mol. Mass.:
36649.72
Organism:
Homo sapiens (Human)
Description:
ChEMBL_1292265
Residue:
319
  
Inhibitor
Name:
BDBM76068
Synonyms:
7-methyl-2-phenyl-4-(p-tolyl)pyrazolo[3,4-d]pyridazine 7-methyl-4-(4-methylphenyl)-2-phenylpyrazolo[3,4-d]pyridazine cid_45917985
Type:
Small organic molecule
Emp. Form.:
C19H16N4
Mol. Mass.:
300.3571
SMILES:
Cc1ccc(cc1)-c1nnc(C)c2nn(cc12)-c1ccccc1
: