Target
Apelin receptor
Ligand
BDBM39035
Substrate
Meas. Tech.
Dose Response confirmation of uHTS hits from a small molecule agonists of the APJ receptor via a luminescent beta-arrestin assay
EC50
>100000±n/a nM
Citation
 PubChem, PC Dose Response confirmation of uHTS hits from a small molecule agonists of the APJ receptor via a luminescent beta-arrestin assay PubChem Bioassay (2010)[AID] 
Target
Name:
Apelin receptor
Synonyms:
AGTRL1 APJ_HUMAN Angiotensin receptor-like 1 Apelin receptor (APJ) G-protein coupled receptor HG11
Type:
Enzyme Catalytic Domain
Mol. Mass.:
42664.06
Organism:
Homo sapiens (Human)
Description:
P35414
Residue:
380
  
Inhibitor
Name:
BDBM39035
Synonyms:
6-(1-benzimidazolylmethyl)-4-(2,5-dimethylphenyl)-2-oxo-3,4-dihydro-1H-pyrimidine-5-carboxylic acid ethyl ester MLS000052003 cid_2973686 ethyl 6-(benzimidazol-1-ylmethyl)-4-(2,5-dimethylphenyl)-2-oxidanylidene-3,4-dihydro-1H-pyrimidine-5-carboxylate | ethyl 6-(benzimidazol-1-ylmethyl)-4-(2,5-dimethylphenyl)-2-oxo-3,4-dihydro-1H-pyrimidine-5-carboxylate
Type:
Small organic molecule
Emp. Form.:
C23H24N4O3
Mol. Mass.:
404.4617
SMILES:
CCOC(=O)C1C(NC(=O)N=C1Cn1cnc2ccccc12)c1cc(C)ccc1C
: