Target
Apelin receptor
Ligand
BDBM76109
Substrate
Meas. Tech.
Dose Response confirmation of uHTS hits from a small molecule agonists of the APJ receptor via a luminescent beta-arrestin assay
EC50
>100000±n/a nM
Citation
 PubChem, PC Dose Response confirmation of uHTS hits from a small molecule agonists of the APJ receptor via a luminescent beta-arrestin assay PubChem Bioassay (2010)[AID] 
Target
Name:
Apelin receptor
Synonyms:
AGTRL1 APJ_HUMAN Angiotensin receptor-like 1 Apelin receptor (APJ) G-protein coupled receptor HG11
Type:
Enzyme Catalytic Domain
Mol. Mass.:
42664.06
Organism:
Homo sapiens (Human)
Description:
P35414
Residue:
380
  
Inhibitor
Name:
BDBM76109
Synonyms:
2-[(5-propylisoxazole-3-carbonyl)amino]-4,5,6,7-tetrahydrobenzothiophene-3-carboxylic acid ethyl ester MLS000116384 cid_5309829 ethyl 2-[(5-propyl-1,2-oxazole-3-carbonyl)amino]-4,5,6,7-tetrahydro-1-benzothiophene-3-carboxylate
Type:
Small organic molecule
Emp. Form.:
C18H22N2O4S
Mol. Mass.:
362.443
SMILES:
CCCc1cc(no1)C(=O)Nc1sc2CCCCc2c1C(=O)OCC
: