Target
Apelin receptor
Ligand
BDBM45657
Substrate
Meas. Tech.
Dose Response confirmation of uHTS hits from a small molecule agonists of the APJ receptor via a luminescent beta-arrestin assay
EC50
>100000±n/a nM
Citation
 PubChem, PC Dose Response confirmation of uHTS hits from a small molecule agonists of the APJ receptor via a luminescent beta-arrestin assay PubChem Bioassay (2010)[AID] 
Target
Name:
Apelin receptor
Synonyms:
AGTRL1 APJ_HUMAN Angiotensin receptor-like 1 Apelin receptor (APJ) G-protein coupled receptor HG11
Type:
Enzyme Catalytic Domain
Mol. Mass.:
42664.06
Organism:
Homo sapiens (Human)
Description:
P35414
Residue:
380
  
Inhibitor
Name:
BDBM45657
Synonyms:
MLS000682486 N-[2-[benzyl(methyl)amino]ethyl]-6-(4-methylpiperidino)sulfonyl-2-(2-pyridyl)cinchoninamide N-[2-[methyl-(phenylmethyl)amino]ethyl]-6-[(4-methyl-1-piperidinyl)sulfonyl]-2-(2-pyridinyl)-4-quinolinecarboxamide SMR000314967 | cid_16195594
Type:
Small organic molecule
Emp. Form.:
C31H35N5O3S
Mol. Mass.:
557.706
SMILES:
CC1CCN(CC1)S(=O)(=O)c1ccc2nc(cc(C(=O)NCCN(C)Cc3ccccc3)c2c1)-c1ccccn1
: