Target
Apelin receptor
Ligand
BDBM46978
Substrate
Meas. Tech.
Dose Response confirmation of uHTS hits from a small molecule agonists of the APJ receptor via a luminescent beta-arrestin assay
EC50
7600±n/a nM
Citation
 PubChem, PC Dose Response confirmation of uHTS hits from a small molecule agonists of the APJ receptor via a luminescent beta-arrestin assay PubChem Bioassay (2010)[AID] 
Target
Name:
Apelin receptor
Synonyms:
AGTRL1 APJ_HUMAN Angiotensin receptor-like 1 Apelin receptor (APJ) G-protein coupled receptor HG11
Type:
Enzyme Catalytic Domain
Mol. Mass.:
42664.06
Organism:
Homo sapiens (Human)
Description:
P35414
Residue:
380
  
Inhibitor
Name:
BDBM46978
Synonyms:
MLS001029917 [(2-methyl-4-oxidanylidene-5-propan-2-yl-cyclohexa-2,5-dien-1-ylidene)amino] benzenesulfonate benzenesulfonic acid [(2-methyl-4-oxo-5-propan-2-yl-1-cyclohexa-2,5-dienylidene)amino] ester benzenesulfonic acid [(Z)-(5-isopropyl-4-keto-2-methyl-cyclohexa-2,5-dien-1-ylidene)amino] ester | cid_1909670
Type:
Small organic molecule
Emp. Form.:
C16H17NO4S
Mol. Mass.:
319.375
SMILES:
CC(=C)c1cc(NOS(=O)(=O)c2ccccc2)c(C)cc1O
: