Target
Apelin receptor
Ligand
BDBM76132
Substrate
Meas. Tech.
Dose Response confirmation of uHTS hits from a small molecule agonists of the APJ receptor via a luminescent beta-arrestin assay
EC50
>100000±n/a nM
Citation
 PubChem, PC Dose Response confirmation of uHTS hits from a small molecule agonists of the APJ receptor via a luminescent beta-arrestin assay PubChem Bioassay (2010)[AID] 
Target
Name:
Apelin receptor
Synonyms:
AGTRL1 APJ_HUMAN Angiotensin receptor-like 1 Apelin receptor (APJ) G-protein coupled receptor HG11
Type:
Enzyme Catalytic Domain
Mol. Mass.:
42664.06
Organism:
Homo sapiens (Human)
Description:
P35414
Residue:
380
  
Inhibitor
Name:
BDBM76132
Synonyms:
MLS001210138 N-[(2,4-dimethoxyphenyl)methylideneamino]-2,6-dimethyl-4-quinolinamine N-[(2,4-dimethoxyphenyl)methylideneamino]-2,6-dimethylquinolin-4-amine [(2,4-dimethoxybenzylidene)amino]-(2,6-dimethyl-4-quinolyl)amine | cid_3141487
Type:
Small organic molecule
Emp. Form.:
C20H21N3O2
Mol. Mass.:
335.3996
SMILES:
COc1ccc(CN=Nc2cc(C)nc3ccc(C)cc23)c(OC)c1
: