Target
Apelin receptor
Ligand
BDBM76143
Substrate
Meas. Tech.
Dose Response confirmation of uHTS hits from a small molecule agonists of the APJ receptor via a luminescent beta-arrestin assay
EC50
>100000±n/a nM
Citation
 PubChem, PC Dose Response confirmation of uHTS hits from a small molecule agonists of the APJ receptor via a luminescent beta-arrestin assay PubChem Bioassay (2010)[AID] 
Target
Name:
Apelin receptor
Synonyms:
AGTRL1 APJ_HUMAN Angiotensin receptor-like 1 Apelin receptor (APJ) G-protein coupled receptor HG11
Type:
Enzyme Catalytic Domain
Mol. Mass.:
42664.06
Organism:
Homo sapiens (Human)
Description:
P35414
Residue:
380
  
Inhibitor
Name:
BDBM76143
Synonyms:
4-(3,4-dihydro-1H-isoquinolin-2-ylsulfonyl)-N-[3-(dimethylamino)propyl]-N-(4-methoxy-1,3-benzothiazol-2-yl)benzamide;hydrochloride SMR000807815 | cid_24891994
Type:
Small organic molecule
Emp. Form.:
C29H32N4O4S2
Mol. Mass.:
564.719
SMILES:
COc1cccc2sc(nc12)N(CCCN(C)C)C(=O)c1ccc(cc1)S(=O)(=O)N1CCc2ccccc2C1
: