Target
Intestinal-type alkaline phosphatase 1
Ligand
BDBM32012
Substrate
Meas. Tech.
Dose Response concentration confirmation of uHTS hits from a small molecule activators of mouse intestinal alkaline phosphatase via a luminescent assay
EC50
63400±n/a nM
Citation
 PubChem, PC Dose Response concentration confirmation of uHTS hits from a small molecule activators of mouse intestinal alkaline phosphatase via a luminescent assay PubChem Bioassay (2010)[AID] 
Target
Name:
Intestinal-type alkaline phosphatase 1
Synonyms:
Alpi | PPBI1_RAT
Type:
Enzyme Catalytic Domain
Mol. Mass.:
58396.39
Organism:
Rattus norvegicus (Rat)
Description:
P15693
Residue:
540
  
Inhibitor
Name:
BDBM32012
Synonyms:
1-(3,4-Dihydroxy-phenyl)-2-(5-phenyl-4H-[1,2,4]triazol-3-ylsulfanyl)-ethanone 1-(3,4-dihydroxyphenyl)-2-[(5-phenyl-1H-1,2,4-triazol-3-yl)thio]ethanone CHEMBL358546 SMR000011758 | cid_654283
Type:
Small organic molecule
Emp. Form.:
C16H13N3O3S
Mol. Mass.:
327.358
SMILES:
Oc1ccc(cc1O)C(=O)CSc1nnc([nH]1)-c1ccccc1
: