Target
Intestinal-type alkaline phosphatase 1
Ligand
BDBM65301
Substrate
Meas. Tech.
Dose Response concentration confirmation of uHTS hits from a small molecule activators of mouse intestinal alkaline phosphatase via a luminescent assay
EC50
8040±n/a nM
Citation
 PubChem, PC Dose Response concentration confirmation of uHTS hits from a small molecule activators of mouse intestinal alkaline phosphatase via a luminescent assay PubChem Bioassay (2010)[AID] 
Target
Name:
Intestinal-type alkaline phosphatase 1
Synonyms:
Alpi | PPBI1_RAT
Type:
Enzyme Catalytic Domain
Mol. Mass.:
58396.39
Organism:
Rattus norvegicus (Rat)
Description:
P15693
Residue:
540
  
Inhibitor
Name:
BDBM65301
Synonyms:
3,4,5-trihydroxybenzohydrazide MLS000713290 cid_592744
Type:
Small organic molecule
Emp. Form.:
C7H8N2O4
Mol. Mass.:
184.1494
SMILES:
NNC(=O)c1cc(O)c(O)c(O)c1
: