Target
Intestinal-type alkaline phosphatase 1
Ligand
BDBM50489
Substrate
Meas. Tech.
Dose Response concentration confirmation of uHTS hits from a small molecule activators of mouse intestinal alkaline phosphatase via a luminescent assay
EC50
21800±n/a nM
Citation
 PubChem, PC Dose Response concentration confirmation of uHTS hits from a small molecule activators of mouse intestinal alkaline phosphatase via a luminescent assay PubChem Bioassay (2010)[AID] 
Target
Name:
Intestinal-type alkaline phosphatase 1
Synonyms:
Alpi | PPBI1_RAT
Type:
Enzyme Catalytic Domain
Mol. Mass.:
58396.39
Organism:
Rattus norvegicus (Rat)
Description:
P15693
Residue:
540
  
Inhibitor
Name:
BDBM50489
Synonyms:
(5E)-5-[(5-methyl-2-furanyl)methylidene]-4-sulfanylidene-2-thiazolidinone (5E)-5-[(5-methylfuran-2-yl)methylidene]-4-sulfanylidene-1,3-thiazolidin-2-one MLS000724119 cid_1371384
Type:
Small organic molecule
Emp. Form.:
C9H7NO2S2
Mol. Mass.:
225.287
SMILES:
Cc1ccc(C=C2SC(O)=NC2=S)o1
: