Target
Intestinal-type alkaline phosphatase 1
Ligand
BDBM53069
Substrate
Meas. Tech.
Dose Response concentration confirmation of uHTS hits from a small molecule activators of mouse intestinal alkaline phosphatase via a luminescent assay
EC50
24900±n/a nM
Citation
 PubChem, PC Dose Response concentration confirmation of uHTS hits from a small molecule activators of mouse intestinal alkaline phosphatase via a luminescent assay PubChem Bioassay (2010)[AID] 
Target
Name:
Intestinal-type alkaline phosphatase 1
Synonyms:
Alpi | PPBI1_RAT
Type:
Enzyme Catalytic Domain
Mol. Mass.:
58396.39
Organism:
Rattus norvegicus (Rat)
Description:
P15693
Residue:
540
  
Inhibitor
Name:
BDBM53069
Synonyms:
4-[2-(2-pyridinylamino)-4-thiazolyl]benzene-1,2-diol 4-[2-(Pyridin-2-ylamino)-thiazol-4-yl]-benzene-1,2-diol MLS001209091 cid_434633
Type:
Small organic molecule
Emp. Form.:
C14H11N3O2S
Mol. Mass.:
285.321
SMILES:
Oc1ccc(cc1O)-c1csc(Nc2ccccn2)n1
: