Target
Intestinal-type alkaline phosphatase 1
Ligand
BDBM76163
Substrate
Meas. Tech.
Dose Response concentration confirmation of uHTS hits from a small molecule activators of mouse intestinal alkaline phosphatase via a luminescent assay
EC50
43100±n/a nM
Citation
 PubChem, PC Dose Response concentration confirmation of uHTS hits from a small molecule activators of mouse intestinal alkaline phosphatase via a luminescent assay PubChem Bioassay (2010)[AID] 
Target
Name:
Intestinal-type alkaline phosphatase 1
Synonyms:
Alpi | PPBI1_RAT
Type:
Enzyme Catalytic Domain
Mol. Mass.:
58396.39
Organism:
Rattus norvegicus (Rat)
Description:
P15693
Residue:
540
  
Inhibitor
Name:
BDBM76163
Synonyms:
Luteoskyrin SMR001215838 | cid_44143715
Type:
Small organic molecule
Emp. Form.:
C30H22O12
Mol. Mass.:
574.4885
SMILES:
[H][C@@]12[C@@H](O)[C@@]3([H])[C@]4([H])[C@H](O)[C@@]([H])(C(=O)C5=C(O)c6c(O)cc(C)c(O)c6C(=O)[C@@]145)[C@]31C(=O)c3c(O)c(C)cc(O)c3C(O)=C1C2=O
: