Target
Intestinal-type alkaline phosphatase 1
Ligand
BDBM33720
Substrate
Meas. Tech.
Dose Response confirmation of uHTS hits from a small molecule inhibitors of mouse intestinal alkaline phosphatase via a luminescent assay
IC50
5120±n/a nM
Citation
 PubChem, PC Dose Response confirmation of uHTS hits from a small molecule inhibitors of mouse intestinal alkaline phosphatase via a luminescent assay PubChem Bioassay (2010)[AID] 
Target
Name:
Intestinal-type alkaline phosphatase 1
Synonyms:
Alpi | PPBI1_RAT
Type:
Enzyme Catalytic Domain
Mol. Mass.:
58396.39
Organism:
Rattus norvegicus (Rat)
Description:
P15693
Residue:
540
  
Inhibitor
Name:
BDBM33720
Synonyms:
1-(3,3-diphenylpropyl)-3-(3-methoxyphenyl)thiourea N-(3,3-diphenylpropyl)-N'-(3-methoxyphenyl)thiourea cid_1322053
Type:
Small organic molecule
Emp. Form.:
C23H24N2OS
Mol. Mass.:
376.514
SMILES:
COc1cccc(NC(=S)NCCC(c2ccccc2)c2ccccc2)c1
: