Target
Intestinal-type alkaline phosphatase 1
Ligand
BDBM57406
Substrate
Meas. Tech.
Dose Response confirmation of uHTS hits from a small molecule inhibitors of mouse intestinal alkaline phosphatase via a luminescent assay
IC50
7040±n/a nM
Citation
 PubChem, PC Dose Response confirmation of uHTS hits from a small molecule inhibitors of mouse intestinal alkaline phosphatase via a luminescent assay PubChem Bioassay (2010)[AID] 
Target
Name:
Intestinal-type alkaline phosphatase 1
Synonyms:
Alpi | PPBI1_RAT
Type:
Enzyme Catalytic Domain
Mol. Mass.:
58396.39
Organism:
Rattus norvegicus (Rat)
Description:
P15693
Residue:
540
  
Inhibitor
Name:
BDBM57406
Synonyms:
1-(4-chloranyl-2-methyl-phenyl)-3-(3,3-diphenylpropyl)thiourea 1-(4-chloro-2-methylphenyl)-3-(3,3-diphenylpropyl)thiourea N-(4-chloro-2-methylphenyl)-N'-(3,3-diphenylpropyl)thiourea cid_2171179
Type:
Small organic molecule
Emp. Form.:
C23H23ClN2S
Mol. Mass.:
394.96
SMILES:
Cc1cc(Cl)ccc1NC(=S)NCCC(c1ccccc1)c1ccccc1
: