Target
Intestinal-type alkaline phosphatase 1
Ligand
BDBM76178
Substrate
Meas. Tech.
Dose Response confirmation of uHTS hits from a small molecule inhibitors of mouse intestinal alkaline phosphatase via a luminescent assay
IC50
8660±n/a nM
Citation
 PubChem, PC Dose Response confirmation of uHTS hits from a small molecule inhibitors of mouse intestinal alkaline phosphatase via a luminescent assay PubChem Bioassay (2010)[AID] 
Target
Name:
Intestinal-type alkaline phosphatase 1
Synonyms:
Alpi | PPBI1_RAT
Type:
Enzyme Catalytic Domain
Mol. Mass.:
58396.39
Organism:
Rattus norvegicus (Rat)
Description:
P15693
Residue:
540
  
Inhibitor
Name:
BDBM76178
Synonyms:
3-[[anilino(oxo)methyl]amino]-4-[4-(2-fluorophenyl)-1-piperazinyl]benzoic acid ethyl ester MLS000584003 cid_12004838 ethyl 4-[4-(2-fluorophenyl)piperazin-1-yl]-3-(phenylcarbamoylamino)benzoate
Type:
Small organic molecule
Emp. Form.:
C26H27FN4O3
Mol. Mass.:
462.516
SMILES:
CCOC(=O)c1ccc(N2CCN(CC2)c2ccccc2F)c(NC(=O)Nc2ccccc2)c1
: