Target
Intestinal-type alkaline phosphatase 1
Ligand
BDBM50304
Substrate
Meas. Tech.
Dose Response confirmation of uHTS hits from a small molecule inhibitors of mouse intestinal alkaline phosphatase via a luminescent assay
IC50
5390±n/a nM
Citation
 PubChem, PC Dose Response confirmation of uHTS hits from a small molecule inhibitors of mouse intestinal alkaline phosphatase via a luminescent assay PubChem Bioassay (2010)[AID] 
Target
Name:
Intestinal-type alkaline phosphatase 1
Synonyms:
Alpi | PPBI1_RAT
Type:
Enzyme Catalytic Domain
Mol. Mass.:
58396.39
Organism:
Rattus norvegicus (Rat)
Description:
P15693
Residue:
540
  
Inhibitor
Name:
BDBM50304
Synonyms:
MLS000720395 cid_15944832 sodium;2-nitro-4-(3-nitro-4-oxido-phenyl)sulfonyl-phenolate | sodium;2-nitro-4-(3-nitro-4-oxidophenyl)sulfonylphenolate
Type:
Small organic molecule
Emp. Form.:
C12H6N2O8S
Mol. Mass.:
338.251
SMILES:
[O-]c1ccc(cc1[N+]([O-])=O)S(=O)(=O)c1ccc([O-])c(c1)[N+]([O-])=O
: