Target
Intestinal-type alkaline phosphatase 1
Ligand
BDBM74492
Substrate
Meas. Tech.
Dose Response confirmation of uHTS hits from a small molecule inhibitors of mouse intestinal alkaline phosphatase via a luminescent assay
IC50
6560±n/a nM
Citation
 PubChem, PC Dose Response confirmation of uHTS hits from a small molecule inhibitors of mouse intestinal alkaline phosphatase via a luminescent assay PubChem Bioassay (2010)[AID] 
Target
Name:
Intestinal-type alkaline phosphatase 1
Synonyms:
Alpi | PPBI1_RAT
Type:
Enzyme Catalytic Domain
Mol. Mass.:
58396.39
Organism:
Rattus norvegicus (Rat)
Description:
P15693
Residue:
540
  
Inhibitor
Name:
BDBM74492
Synonyms:
1-cyclohexyl-3-(2,4-dichlorobenzyl)thiourea MLS000390041 cid_2349856
Type:
Small organic molecule
Emp. Form.:
C14H18Cl2N2S
Mol. Mass.:
317.277
SMILES:
Clc1ccc(CNC(=S)NC2CCCCC2)c(Cl)c1
: