Target
Intestinal-type alkaline phosphatase 1
Ligand
BDBM76179
Substrate
Meas. Tech.
Dose Response confirmation of uHTS hits from a small molecule inhibitors of mouse intestinal alkaline phosphatase via a luminescent assay
IC50
12900±n/a nM
Citation
 PubChem, PC Dose Response confirmation of uHTS hits from a small molecule inhibitors of mouse intestinal alkaline phosphatase via a luminescent assay PubChem Bioassay (2010)[AID] 
Target
Name:
Intestinal-type alkaline phosphatase 1
Synonyms:
Alpi | PPBI1_RAT
Type:
Enzyme Catalytic Domain
Mol. Mass.:
58396.39
Organism:
Rattus norvegicus (Rat)
Description:
P15693
Residue:
540
  
Inhibitor
Name:
BDBM76179
Synonyms:
6-bromo-N'-(2,4-dihydroxybenzoyl)-2-keto-chromene-3-carbohydrazide 6-bromo-N'-[(2,4-dihydroxyphenyl)-oxomethyl]-2-oxo-1-benzopyran-3-carbohydrazide N'-[2,4-bis(oxidanyl)phenyl]carbonyl-6-bromanyl-2-oxidanylidene-chromene-3-carbohydrazide cid_1652555
Type:
Small organic molecule
Emp. Form.:
C17H11BrN2O6
Mol. Mass.:
419.183
SMILES:
Oc1ccc(C(=O)NNC(=O)c2cc3cc(Br)ccc3oc2=O)c(O)c1
: