Target
Intestinal-type alkaline phosphatase 1
Ligand
BDBM76182
Substrate
Meas. Tech.
Dose Response confirmation of uHTS hits from a small molecule inhibitors of mouse intestinal alkaline phosphatase via a luminescent assay
IC50
216±n/a nM
Citation
 PubChem, PC Dose Response confirmation of uHTS hits from a small molecule inhibitors of mouse intestinal alkaline phosphatase via a luminescent assay PubChem Bioassay (2010)[AID] 
Target
Name:
Intestinal-type alkaline phosphatase 1
Synonyms:
Alpi | PPBI1_RAT
Type:
Enzyme Catalytic Domain
Mol. Mass.:
58396.39
Organism:
Rattus norvegicus (Rat)
Description:
P15693
Residue:
540
  
Inhibitor
Name:
BDBM76182
Synonyms:
1-(2-nitrophenyl)-3-[[(Z)-(3-oxidanyl-4-oxidanylidene-cyclohexa-2,5-dien-1-ylidene)methyl]amino]thiourea 1-[[(Z)-(3-hydroxy-4-oxo-1-cyclohexa-2,5-dienylidene)methyl]amino]-3-(2-nitrophenyl)thiourea MLS000417596 cid_16189676
Type:
Small organic molecule
Emp. Form.:
C14H12N4O4S
Mol. Mass.:
332.334
SMILES:
Oc1c[c-](C=[NH+]NC(=S)Nc2ccccc2[N+]([O-])=O)ccc1=O
: