Target
Intestinal-type alkaline phosphatase 1
Ligand
BDBM53139
Substrate
Meas. Tech.
Dose Response confirmation of uHTS hits from a small molecule inhibitors of mouse intestinal alkaline phosphatase via a luminescent assay
IC50
2970±n/a nM
Citation
 PubChem, PC Dose Response confirmation of uHTS hits from a small molecule inhibitors of mouse intestinal alkaline phosphatase via a luminescent assay PubChem Bioassay (2010)[AID] 
Target
Name:
Intestinal-type alkaline phosphatase 1
Synonyms:
Alpi | PPBI1_RAT
Type:
Enzyme Catalytic Domain
Mol. Mass.:
58396.39
Organism:
Rattus norvegicus (Rat)
Description:
P15693
Residue:
540
  
Inhibitor
Name:
BDBM53139
Synonyms:
4-[[(E)-3-(2-furyl)acryloyl]thiocarbamoylamino]benzoic acid 4-[[[[(E)-3-(2-furanyl)-1-oxoprop-2-enyl]amino]-sulfanylidenemethyl]amino]benzoic acid SMR000539235 | cid_947839
Type:
Small organic molecule
Emp. Form.:
C15H12N2O4S
Mol. Mass.:
316.332
SMILES:
OC(=O)c1ccc(NC(=S)NC(=O)C=Cc2ccco2)cc1
: