Target
Intestinal-type alkaline phosphatase 1
Ligand
BDBM60915
Substrate
Meas. Tech.
Dose Response confirmation of uHTS hits from a small molecule inhibitors of mouse intestinal alkaline phosphatase via a luminescent assay
IC50
14300±n/a nM
Citation
 PubChem, PC Dose Response confirmation of uHTS hits from a small molecule inhibitors of mouse intestinal alkaline phosphatase via a luminescent assay PubChem Bioassay (2010)[AID] 
Target
Name:
Intestinal-type alkaline phosphatase 1
Synonyms:
Alpi | PPBI1_RAT
Type:
Enzyme Catalytic Domain
Mol. Mass.:
58396.39
Organism:
Rattus norvegicus (Rat)
Description:
P15693
Residue:
540
  
Inhibitor
Name:
BDBM60915
Synonyms:
(E)-2-cyano-3-(3,4-dihydroxyphenyl)-N-(5-quinolinyl)-2-propenamide (E)-2-cyano-3-(3,4-dihydroxyphenyl)-N-quinolin-5-ylprop-2-enamide MLS001173932 cid_9114427
Type:
Small organic molecule
Emp. Form.:
C19H13N3O3
Mol. Mass.:
331.3248
SMILES:
Oc1ccc(\C=C(/C#N)C(=O)Nc2cccc3ncccc23)cc1O
: