Target
Intestinal-type alkaline phosphatase 1
Ligand
BDBM76208
Substrate
Meas. Tech.
Dose Response confirmation of uHTS hits from a small molecule inhibitors of mouse intestinal alkaline phosphatase via a luminescent assay
IC50
10300±n/a nM
Citation
 PubChem, PC Dose Response confirmation of uHTS hits from a small molecule inhibitors of mouse intestinal alkaline phosphatase via a luminescent assay PubChem Bioassay (2010)[AID] 
Target
Name:
Intestinal-type alkaline phosphatase 1
Synonyms:
Alpi | PPBI1_RAT
Type:
Enzyme Catalytic Domain
Mol. Mass.:
58396.39
Organism:
Rattus norvegicus (Rat)
Description:
P15693
Residue:
540
  
Inhibitor
Name:
BDBM76208
Synonyms:
1-[(1-allyl-3-methyl-pyrazol-4-yl)methyl]-N-[3-(3-chlorophenyl)phenyl]isonipecotamide N-[3-(3-chlorophenyl)phenyl]-1-[(3-methyl-1-prop-2-enyl-4-pyrazolyl)methyl]-4-piperidinecarboxamide N-[3-(3-chlorophenyl)phenyl]-1-[(3-methyl-1-prop-2-enylpyrazol-4-yl)methyl]piperidine-4-carboxamide cid_24790205
Type:
Small organic molecule
Emp. Form.:
C26H29ClN4O
Mol. Mass.:
448.988
SMILES:
Cc1nn(CC=C)cc1CN1CCC(CC1)C(=O)Nc1cccc(c1)-c1cccc(Cl)c1
: