Target
Intestinal-type alkaline phosphatase 1
Ligand
BDBM76211
Substrate
Meas. Tech.
Dose Response confirmation of uHTS hits from a small molecule inhibitors of mouse intestinal alkaline phosphatase via a luminescent assay
IC50
9390±n/a nM
Citation
 PubChem, PC Dose Response confirmation of uHTS hits from a small molecule inhibitors of mouse intestinal alkaline phosphatase via a luminescent assay PubChem Bioassay (2010)[AID] 
Target
Name:
Intestinal-type alkaline phosphatase 1
Synonyms:
Alpi | PPBI1_RAT
Type:
Enzyme Catalytic Domain
Mol. Mass.:
58396.39
Organism:
Rattus norvegicus (Rat)
Description:
P15693
Residue:
540
  
Inhibitor
Name:
BDBM76211
Synonyms:
MLS001083154 N-[3-(3-chlorophenyl)phenyl]-1-cyclobutyl-isonipecotamide N-[3-(3-chlorophenyl)phenyl]-1-cyclobutylpiperidine-4-carboxamide cid_24790619
Type:
Small organic molecule
Emp. Form.:
C22H25ClN2O
Mol. Mass.:
368.9
SMILES:
Clc1cccc(c1)-c1cccc(NC(=O)C2CCN(CC2)C2CCC2)c1
: