Target
Intestinal-type alkaline phosphatase 1
Ligand
BDBM76219
Substrate
Meas. Tech.
Dose Response confirmation of uHTS hits from a small molecule inhibitors of mouse intestinal alkaline phosphatase via a luminescent assay
IC50
2400±n/a nM
Citation
 PubChem, PC Dose Response confirmation of uHTS hits from a small molecule inhibitors of mouse intestinal alkaline phosphatase via a luminescent assay PubChem Bioassay (2010)[AID] 
Target
Name:
Intestinal-type alkaline phosphatase 1
Synonyms:
Alpi | PPBI1_RAT
Type:
Enzyme Catalytic Domain
Mol. Mass.:
58396.39
Organism:
Rattus norvegicus (Rat)
Description:
P15693
Residue:
540
  
Inhibitor
Name:
BDBM76219
Synonyms:
3-[(2-keto-3H-1,3-benzoxazol-6-yl)sulfonylamino]-N-phenyl-propionamide 3-[(2-oxo-3H-1,3-benzoxazol-6-yl)sulfonylamino]-N-phenylpropanamide SMR000631059 | cid_24792835
Type:
Small organic molecule
Emp. Form.:
C16H15N3O5S
Mol. Mass.:
361.372
SMILES:
O=C(CCNS(=O)(=O)c1ccc2[nH]c(=O)oc2c1)Nc1ccccc1
: