Target
Intestinal-type alkaline phosphatase 1
Ligand
BDBM76248
Substrate
Meas. Tech.
Dose Response confirmation of uHTS hits from a small molecule inhibitors of mouse intestinal alkaline phosphatase via a luminescent assay
IC50
5660±n/a nM
Citation
 PubChem, PC Dose Response confirmation of uHTS hits from a small molecule inhibitors of mouse intestinal alkaline phosphatase via a luminescent assay PubChem Bioassay (2010)[AID] 
Target
Name:
Intestinal-type alkaline phosphatase 1
Synonyms:
Alpi | PPBI1_RAT
Type:
Enzyme Catalytic Domain
Mol. Mass.:
58396.39
Organism:
Rattus norvegicus (Rat)
Description:
P15693
Residue:
540
  
Inhibitor
Name:
BDBM76248
Synonyms:
2-[3,4-bis(oxidanyl)phenyl]-3-[(2S,3R,4R,5S,6R)-6-(hydroxymethyl)-5-[(2S,3R,4R,5R,6S)-6-methyl-3,4,5-tris(oxidanyl)oxan-2-yl]oxy-3,4-bis(oxidanyl)oxan-2-yl]oxy-5,7-bis(oxidanyl)chromen-4-one 3-[(2S,3R,4R,5S,6R)-3,4-dihydroxy-6-methylol-5-[(2S,3R,4R,5R,6S)-3,4,5-trihydroxy-6-methyl-tetrahydropyran-2-yl]oxy-tetrahydropyran-2-yl]oxy-2-(3,4-dihydroxyphenyl)-5,7-dihydroxy-chromone MLS002472999 cid_44144321 | quercetin-3-rham(4)-gluc
Type:
Small organic molecule
Emp. Form.:
C27H30O16
Mol. Mass.:
610.5175
SMILES:
C[C@@H]1O[C@@H](O[C@@H]2[C@@H](CO)O[C@@H](Oc3c(O)c4c(cc(O)cc4=O)oc3-c3ccc(O)c(O)c3)[C@H](O)[C@H]2O)[C@H](O)[C@H](O)[C@H]1O
: