Target
Integrin alpha-4
Ligand
BDBM75443
Substrate
Meas. Tech.
SAR Confirmatory Dose Response LIBS Assay for Allosteric Ligands of the VLA-4 Integrin
EC50
>57030±n/a nM
Citation
 PubChem, PC SAR Confirmatory Dose Response LIBS Assay for Allosteric Ligands of the VLA-4 Integrin PubChem Bioassay (2010)[AID] 
Target
Name:
Integrin alpha-4
Synonyms:
CD49 antigen-like family member D CD49d antigen ITA4_HUMAN Integrin alpha-4 Integrin alpha-IV VLA-4 integrin alpha 4 precursor | integrin alpha-4 precursor
Type:
Membrane Protein
Mol. Mass.:
114897.35
Organism:
Homo sapiens (Human)
Description:
P13612
Residue:
1032
  
Inhibitor
Name:
BDBM75443
Synonyms:
2-[4-[2-(4-methoxyphenyl)-1-benzothiophen-3-yl]phenoxy]-N,N-dimethyl-ethanamine 2-[4-[2-(4-methoxyphenyl)benzothiophen-3-yl]phenoxy]ethyl-dimethyl-amine MLS002473632 cid_44202275
Type:
Small organic molecule
Emp. Form.:
C25H25NO2S
Mol. Mass.:
403.537
SMILES:
COc1ccc(cc1)-c1sc2ccccc2c1-c1ccc(OCCN(C)C)cc1
: