Target
Intestinal-type alkaline phosphatase
Ligand
BDBM39617
Substrate
Meas. Tech.
Dose Response confirmation of uHTS hits from a small molecule inhibitors of human intestinal alkaline phosphatase via a luminescent assay - Set 2
IC50
1290±n/a nM
Citation
 PubChem, PC Dose Response confirmation of uHTS hits from a small molecule inhibitors of human intestinal alkaline phosphatase via a luminescent assay - Set 2 PubChem Bioassay (2010)[AID] 
Target
Name:
Intestinal-type alkaline phosphatase
Synonyms:
ALPI Intestinal alkaline phosphatase | PPBI_HUMAN
Type:
PROTEIN
Mol. Mass.:
56804.94
Organism:
Homo sapiens (Human)
Description:
ChEMBL_1278525
Residue:
528
  
Inhibitor
Name:
BDBM39617
Synonyms:
3-[5-(methylamino)-1,3,4-thiadiazol-2-yl]-1-benzopyran-2-one 3-[5-(methylamino)-1,3,4-thiadiazol-2-yl]chromen-2-one MLS000094728 cid_3244772
Type:
Small organic molecule
Emp. Form.:
C12H9N3O2S
Mol. Mass.:
259.284
SMILES:
CNc1nnc(s1)-c1cc2ccccc2oc1=O
: