Target
NACHT, LRR and PYD domains-containing protein 3
Ligand
BDBM76285
Substrate
Meas. Tech.
Dose Response confirmation of uHTS for the identification of inhibitors of NALP3 in yeast using a luminescent assay
IC50
23300±n/a nM
Citation
 PubChem, PC Dose Response confirmation of uHTS for the identification of inhibitors of NALP3 in yeast using a luminescent assay PubChem Bioassay (2010)[AID] 
Target
Name:
NACHT, LRR and PYD domains-containing protein 3
Synonyms:
C1orf7 NALP3 NLRP3 protein PYPAF1
Type:
Enzyme Catalytic Domain
Mol. Mass.:
118173.88
Organism:
Homo sapiens (Human)
Description:
Q96P20
Residue:
1036
  
Inhibitor
Name:
BDBM76285
Synonyms:
3-Bromo-benzoic acid N'-(2-piperidin-1-yl-acetyl)-hydrazide 3-bromo-N'-(2-piperidin-1-ylacetyl)benzohydrazide 3-bromo-N'-[1-oxo-2-(1-piperidinyl)ethyl]benzohydrazide SMR000608231 | cid_780402
Type:
Small organic molecule
Emp. Form.:
C14H18BrN3O2
Mol. Mass.:
340.216
SMILES:
Brc1cccc(c1)C(=O)NNC(=O)CN1CCCCC1
: