Target
NACHT, LRR and PYD domains-containing protein 3
Ligand
BDBM58586
Substrate
Meas. Tech.
Dose Response confirmation of uHTS for the identification of inhibitors of NALP3 in yeast using a luminescent assay
IC50
1940±n/a nM
Citation
 PubChem, PC Dose Response confirmation of uHTS for the identification of inhibitors of NALP3 in yeast using a luminescent assay PubChem Bioassay (2010)[AID] 
Target
Name:
NACHT, LRR and PYD domains-containing protein 3
Synonyms:
C1orf7 NALP3 NLRP3 protein PYPAF1
Type:
Enzyme Catalytic Domain
Mol. Mass.:
118173.88
Organism:
Homo sapiens (Human)
Description:
Q96P20
Residue:
1036
  
Inhibitor
Name:
BDBM58586
Synonyms:
2-Fluoro-benzoic acid N'-(4-hydroxy-1-methyl-2-oxo-1,2-dihydro-quinoline-3-carbonyl)-hydrazide N''-(2-fluorobenzoyl)-2-hydroxy-1-methyl-4-oxoquinoline-3-carbohydrazide N''-(2-fluorophenyl)carbonyl-1-methyl-2-oxidanyl-4-oxidanylidene-quinoline-3-carbohydrazide N'-(2-fluorobenzoyl)-2-hydroxy-4-keto-1-methyl-quinoline-3-carbohydrazide SMR000608064 | cid_3115944
Type:
Small organic molecule
Emp. Form.:
C18H14FN3O4
Mol. Mass.:
355.3199
SMILES:
Cn1c2ccccc2c(O)c(C(=O)NNC(=O)c2ccccc2F)c1=O
: