Target
NACHT, LRR and PYD domains-containing protein 3
Ligand
BDBM41580
Substrate
Meas. Tech.
Dose Response confirmation of inhibitors of NALP3 in yeast using a Caspase-1-ASC counter screen
IC50
6260±n/a nM
Citation
 PubChem, PC Dose Response confirmation of inhibitors of NALP3 in yeast using a Caspase-1-ASC counter screen PubChem Bioassay (2010)[AID] 
Target
Name:
NACHT, LRR and PYD domains-containing protein 3
Synonyms:
C1orf7 NALP3 NLRP3 protein PYPAF1
Type:
Enzyme Catalytic Domain
Mol. Mass.:
118173.88
Organism:
Homo sapiens (Human)
Description:
Q96P20
Residue:
1036
  
Inhibitor
Name:
BDBM41580
Synonyms:
(4-nonyl-1,2,3,5,6,7-hexahydrodicyclopenta[1,2-c:1',2'-g]pyridin-8-ylidene)amine;hydrobromide 4-nonyl-2,3,4,5,6,7-hexahydrodicyclopenta[b,e]pyridin-8(1H)-imine SMR000114363 | cid_9549110
Type:
Small organic molecule
Emp. Form.:
C20H32N2
Mol. Mass.:
300.4815
SMILES:
CCCCCCCCCn1c2CCCc2c(=N)c2CCCc12
: