Target
NACHT, LRR and PYD domains-containing protein 3
Ligand
BDBM50073099
Substrate
Meas. Tech.
Dose Response confirmation of inhibitors of NALP3 in yeast using a Caspase-1-ASC counter screen
IC50
5660±n/a nM
Citation
 PubChem, PC Dose Response confirmation of inhibitors of NALP3 in yeast using a Caspase-1-ASC counter screen PubChem Bioassay (2010)[AID] 
Target
Name:
NACHT, LRR and PYD domains-containing protein 3
Synonyms:
C1orf7 NALP3 NLRP3 protein PYPAF1
Type:
Enzyme Catalytic Domain
Mol. Mass.:
118173.88
Organism:
Homo sapiens (Human)
Description:
Q96P20
Residue:
1036
  
Inhibitor
Name:
BDBM50073099
Synonyms:
(9E,11E)-(4R,6R,8R)-16-chloro-17,19-dihydroxy-4-methyl-3,7-dioxa-tricyclo[13.4.0.0*6,8*]nonadeca-1(15),9,11,16,18-pentaene-2,13-dione (9Z,11E)-(4R,6R,8R)-16-Chloro-17,19-dihydroxy-4-methyl-3,7-dioxa-tricyclo[13.4.0.0*6,8*]nonadeca-1(19),9,11,15,17-pentaene-2,13-dione (9Z,11E)-(4S,6R,8S)-16-Chloro-17,19-dihydroxy-4-methyl-3,7-dioxa-tricyclo[13.4.0.0*6,8*]nonadeca-1(19),9,11,15,17-pentaene-2,13-dione (Z)-(R)-16-Chloro-17,19-dihydroxy-4-(R)-methyl-3,7-dioxa-tricyclo[13.4.0.0*6,8*]nonadeca-1(19),9,11,15,17-pentaene-2,13-dione CHEMBL453386 radicicol
Type:
Small organic molecule
Emp. Form.:
C18H17ClO6
Mol. Mass.:
364.777
SMILES:
C[C@H]1C[C@H]2O[C@H]2C=CC=CC(=O)Cc2c(Cl)c(O)cc(O)c2C(=O)O1
: