Target
NACHT, LRR and PYD domains-containing protein 3
Ligand
BDBM76291
Substrate
Meas. Tech.
Dose Response confirmation of inhibitors of NALP3 in yeast using a Caspase-1-ASC counter screen
IC50
2240±n/a nM
Citation
 PubChem, PC Dose Response confirmation of inhibitors of NALP3 in yeast using a Caspase-1-ASC counter screen PubChem Bioassay (2010)[AID] 
Target
Name:
NACHT, LRR and PYD domains-containing protein 3
Synonyms:
C1orf7 NALP3 NLRP3 protein PYPAF1
Type:
Enzyme Catalytic Domain
Mol. Mass.:
118173.88
Organism:
Homo sapiens (Human)
Description:
Q96P20
Residue:
1036
  
Inhibitor
Name:
BDBM76291
Synonyms:
MLS001234025 N-[2-(cyclohexen-1-yl)ethyl]-5-hydroxy-7-keto-thiazolo[3,2-a]pyrimidine-6-carboxamide N-[2-(cyclohexen-1-yl)ethyl]-5-oxidanyl-7-oxidanylidene-[1,3]thiazolo[3,2-a]pyrimidine-6-carboxamide cid_18575833
Type:
Small organic molecule
Emp. Form.:
C15H17N3O3S
Mol. Mass.:
319.379
SMILES:
Oc1c(C(=O)NCCC2=CCCCC2)c(=O)nc2sccn12
: