Target
NACHT, LRR and PYD domains-containing protein 3
Ligand
BDBM76296
Substrate
Meas. Tech.
Dose Response confirmation of inhibitors of NALP3 in yeast using a Caspase-1-ASC counter screen
IC50
665±n/a nM
Citation
 PubChem, PC Dose Response confirmation of inhibitors of NALP3 in yeast using a Caspase-1-ASC counter screen PubChem Bioassay (2010)[AID] 
Target
Name:
NACHT, LRR and PYD domains-containing protein 3
Synonyms:
C1orf7 NALP3 NLRP3 protein PYPAF1
Type:
Enzyme Catalytic Domain
Mol. Mass.:
118173.88
Organism:
Homo sapiens (Human)
Description:
Q96P20
Residue:
1036
  
Inhibitor
Name:
BDBM76296
Synonyms:
4-Methoxy-5-acetoxy-canthin-6-one SMR001215934 | cid_24982172
Type:
Small organic molecule
Emp. Form.:
C17H12N2O4
Mol. Mass.:
308.2882
SMILES:
COc1c(OC(C)=O)c(=O)n2c3ccccc3c3ccnc1c23
: