Target
60S ribosomal protein L19-A
Ligand
BDBM72561
Substrate
Meas. Tech.
Confirmatory Cherry Pick 3 SAR Dose Response Multiplex in TOR pathway GFP-fusion proteins for Saccharomyes cerevisiae, specifically RPL19A
EC50
876.1±n/a nM
Citation
 PubChem, PC Confirmatory Cherry Pick 3 SAR Dose Response Multiplex in TOR pathway GFP-fusion proteins for Saccharomyes cerevisiae, specifically RPL19A PubChem Bioassay (2011)[AID] 
Target
Name:
60S ribosomal protein L19-A
Synonyms:
RL19A_YEAST RPL23A | YL14A
Type:
Enzyme Catalytic Domain
Mol. Mass.:
21739.62
Organism:
Saccharomyces cerevisiae
Description:
gi_536029
Residue:
189
  
Inhibitor
Name:
BDBM72561
Synonyms:
1-(4-methylanilino)-3-phenylpyrrole-2,5-dione 3-phenyl-1-(4-toluidino)-1H-pyrrole-2,5-dione MLS000695009 cid_3775626
Type:
Small organic molecule
Emp. Form.:
C17H14N2O2
Mol. Mass.:
278.3053
SMILES:
Cc1ccc(NN2C(=O)C=C(C2=O)c2ccccc2)cc1
: