Target
Intestinal-type alkaline phosphatase
Ligand
BDBM69266
Substrate
Meas. Tech.
Dose Response concentration confirmation of uHTS hits from a small molecule activators of human intestinal alkaline phosphatase via a luminescent assay - Set 2
EC50
12500±n/a nM
Citation
 PubChem, PC Dose Response concentration confirmation of uHTS hits from a small molecule activators of human intestinal alkaline phosphatase via a luminescent assay - Set 2 PubChem Bioassay (2010)[AID] 
Target
Name:
Intestinal-type alkaline phosphatase
Synonyms:
ALPI Intestinal alkaline phosphatase | PPBI_HUMAN
Type:
PROTEIN
Mol. Mass.:
56804.94
Organism:
Homo sapiens (Human)
Description:
ChEMBL_1278525
Residue:
528
  
Inhibitor
Name:
BDBM69266
Synonyms:
MLS000419199 SMR000319854 [(E)-(4-ethylbenzylidene)amino]-(7H-purin-6-yl)amine | cid_5085133
Type:
Small organic molecule
Emp. Form.:
C14H14N6
Mol. Mass.:
266.3012
SMILES:
CCc1ccc(CN=Nc2ncnc3nc[nH]c23)cc1
: