Target
Intestinal-type alkaline phosphatase
Ligand
BDBM75656
Substrate
Meas. Tech.
Dose Response concentration confirmation of uHTS hits from a small molecule activators of human intestinal alkaline phosphatase via a luminescent assay - Set 2
EC50
8770±n/a nM
Citation
 PubChem, PC Dose Response concentration confirmation of uHTS hits from a small molecule activators of human intestinal alkaline phosphatase via a luminescent assay - Set 2 PubChem Bioassay (2010)[AID] 
Target
Name:
Intestinal-type alkaline phosphatase
Synonyms:
ALPI Intestinal alkaline phosphatase | PPBI_HUMAN
Type:
PROTEIN
Mol. Mass.:
56804.94
Organism:
Homo sapiens (Human)
Description:
ChEMBL_1278525
Residue:
528
  
Inhibitor
Name:
BDBM75656
Synonyms:
(3Z)-5-(hydroxyamino)-6-nitroso-3-phenacylidene-1,4-dihydropyrazin-2-one MLS001164264 cid_5904198
Type:
Small organic molecule
Emp. Form.:
C12H10N4O4
Mol. Mass.:
274.2322
SMILES:
ONc1nc(CC(=O)c2ccccc2)c(=O)[nH]c1N=O
: