Target
Intestinal-type alkaline phosphatase
Ligand
BDBM75657
Substrate
Meas. Tech.
Dose Response concentration confirmation of uHTS hits from a small molecule activators of human intestinal alkaline phosphatase via a luminescent assay - Set 2
EC50
46900±n/a nM
Citation
 PubChem, PC Dose Response concentration confirmation of uHTS hits from a small molecule activators of human intestinal alkaline phosphatase via a luminescent assay - Set 2 PubChem Bioassay (2010)[AID] 
Target
Name:
Intestinal-type alkaline phosphatase
Synonyms:
ALPI Intestinal alkaline phosphatase | PPBI_HUMAN
Type:
PROTEIN
Mol. Mass.:
56804.94
Organism:
Homo sapiens (Human)
Description:
ChEMBL_1278525
Residue:
528
  
Inhibitor
Name:
BDBM75657
Synonyms:
1-[[1-(2-chlorobenzyl)-4-piperidyl]methyl]-3-(3,4,5-trimethoxyphenyl)urea 1-[[1-[(2-chlorophenyl)methyl]piperidin-4-yl]methyl]-3-(3,4,5-trimethoxyphenyl)urea N-{[1-(2-chlorobenzyl)piperidin-4-yl]methyl}-N'-(3,4,5-trimethoxyphenyl)urea cid_15989538
Type:
Small organic molecule
Emp. Form.:
C23H30ClN3O4
Mol. Mass.:
447.955
SMILES:
COc1cc(NC(=O)NCC2CCN(Cc3ccccc3Cl)CC2)cc(OC)c1OC
: