Target
Intestinal-type alkaline phosphatase
Ligand
BDBM75659
Substrate
Meas. Tech.
Dose Response concentration confirmation of uHTS hits from a small molecule activators of human intestinal alkaline phosphatase via a luminescent assay - Set 2
EC50
16000±n/a nM
Citation
 PubChem, PC Dose Response concentration confirmation of uHTS hits from a small molecule activators of human intestinal alkaline phosphatase via a luminescent assay - Set 2 PubChem Bioassay (2010)[AID] 
Target
Name:
Intestinal-type alkaline phosphatase
Synonyms:
ALPI Intestinal alkaline phosphatase | PPBI_HUMAN
Type:
PROTEIN
Mol. Mass.:
56804.94
Organism:
Homo sapiens (Human)
Description:
ChEMBL_1278525
Residue:
528
  
Inhibitor
Name:
BDBM75659
Synonyms:
1-[[(E)-(3-methoxy-6-oxidanylidene-cyclohexa-2,4-dien-1-ylidene)methyl]amino]-3-(2-phenylethyl)thiourea 1-[[(E)-(3-methoxy-6-oxocyclohexa-2,4-dien-1-ylidene)methyl]amino]-3-(2-phenylethyl)thiourea MLS001171019 cid_6508339
Type:
Small organic molecule
Emp. Form.:
C17H19N3O2S
Mol. Mass.:
329.417
SMILES:
COc1ccc(O)c(C=NNC(=S)NCCc2ccccc2)c1
: