Target
Intestinal-type alkaline phosphatase
Ligand
BDBM51928
Substrate
Meas. Tech.
Dose Response concentration confirmation of uHTS hits from a small molecule activators of human intestinal alkaline phosphatase via a luminescent assay - Set 2
EC50
67300±n/a nM
Citation
 PubChem, PC Dose Response concentration confirmation of uHTS hits from a small molecule activators of human intestinal alkaline phosphatase via a luminescent assay - Set 2 PubChem Bioassay (2010)[AID] 
Target
Name:
Intestinal-type alkaline phosphatase
Synonyms:
ALPI Intestinal alkaline phosphatase | PPBI_HUMAN
Type:
PROTEIN
Mol. Mass.:
56804.94
Organism:
Homo sapiens (Human)
Description:
ChEMBL_1278525
Residue:
528
  
Inhibitor
Name:
BDBM51928
Synonyms:
MLS001090557 N-[3-(3-chlorophenyl)phenyl]-1-[(1-propan-2-yl-4-pyrazolyl)methyl]-4-piperidinecarboxamide SMR000664674 | cid_24790786
Type:
Small organic molecule
Emp. Form.:
C25H29ClN4O
Mol. Mass.:
436.977
SMILES:
CC(C)n1cc(CN2CCC(CC2)C(=O)Nc2cccc(c2)-c2cccc(Cl)c2)cn1
: