Target
Intestinal-type alkaline phosphatase
Ligand
BDBM75674
Substrate
Meas. Tech.
Dose Response concentration confirmation of uHTS hits from a small molecule activators of human intestinal alkaline phosphatase via a luminescent assay - Set 2
EC50
14100±n/a nM
Citation
 PubChem, PC Dose Response concentration confirmation of uHTS hits from a small molecule activators of human intestinal alkaline phosphatase via a luminescent assay - Set 2 PubChem Bioassay (2010)[AID] 
Target
Name:
Intestinal-type alkaline phosphatase
Synonyms:
ALPI Intestinal alkaline phosphatase | PPBI_HUMAN
Type:
PROTEIN
Mol. Mass.:
56804.94
Organism:
Homo sapiens (Human)
Description:
ChEMBL_1278525
Residue:
528
  
Inhibitor
Name:
BDBM75674
Synonyms:
4-methyl-N-[3-(methylthio)-1-[[(2-morpholinothiazole-4-carbonyl)amino]carbamoyl]propyl]benzenesulfonamide 4-methyl-N-[4-methylsulfanyl-1-[2-(2-morpholin-4-yl-1,3-thiazole-4-carbonyl)hydrazinyl]-1-oxobutan-2-yl]benzenesulfonamide MLS001031833 cid_24816546
Type:
Small organic molecule
Emp. Form.:
C20H27N5O5S3
Mol. Mass.:
513.654
SMILES:
CSCCC(NS(=O)(=O)c1ccc(C)cc1)C(=O)NNC(=O)c1csc(n1)N1CCOCC1
: