Target
Kappa-type opioid receptor
Ligand
BDBM71569
Substrate
Meas. Tech.
SAR analysis of Antagonists of the Kappa Opioid Receptor (KOR) using an Image-Based Assay - Set 3
IC50
>32000±n/a nM
Citation
 PubChem, PC SAR analysis of Antagonists of the Kappa Opioid Receptor (KOR) using an Image-Based Assay - Set 3 PubChem Bioassay (2010)[AID] 
Target
Name:
Kappa-type opioid receptor
Synonyms:
K-OR-1 Kappa-opioid receptor (KOR) Kappa-type opioid receptor (KOR) OPIATE Kappa OPRK1 kappa opioid receptor (KOR)
Type:
G Protein-Coupled Receptor (GPCR)
Mol. Mass.:
42648.76
Organism:
Homo sapiens (Human)
Description:
P41145
Residue:
380
  
Inhibitor
Name:
BDBM71569
Synonyms:
KSC-5-267A N-(2-isoindolin-2-ylethyl)-4-[(m-tolylsulfonylamino)methyl]benzamide cid_44608035
Type:
Small organic molecule
Emp. Form.:
C25H27N3O3S
Mol. Mass.:
449.565
SMILES:
Cc1cccc(c1)S(=O)(=O)NCc1ccc(cc1)C(=O)NCCN1Cc2ccccc2C1
: