Target
Kappa-type opioid receptor
Ligand
BDBM71592
Substrate
Meas. Tech.
SAR analysis of Antagonists of the Kappa Opioid Receptor (KOR) using an Image-Based Assay - Set 3
IC50
6080±n/a nM
Citation
 PubChem, PC SAR analysis of Antagonists of the Kappa Opioid Receptor (KOR) using an Image-Based Assay - Set 3 PubChem Bioassay (2010)[AID] 
Target
Name:
Kappa-type opioid receptor
Synonyms:
K-OR-1 Kappa-opioid receptor (KOR) Kappa-type opioid receptor (KOR) OPIATE Kappa OPRK1 kappa opioid receptor (KOR)
Type:
G Protein-Coupled Receptor (GPCR)
Mol. Mass.:
42648.76
Organism:
Homo sapiens (Human)
Description:
P41145
Residue:
380
  
Inhibitor
Name:
BDBM71592
Synonyms:
4-[(brosylamino)methyl]-N-[2-(dibenzylamino)ethyl]benzamide KSC-11-43-1 N-[2-[bis(phenylmethyl)amino]ethyl]-4-[[(4-bromophenyl)sulfonylamino]methyl]benzamide | cid_44620908
Type:
Small organic molecule
Emp. Form.:
C30H30BrN3O3S
Mol. Mass.:
592.546
SMILES:
Brc1ccc(cc1)S(=O)(=O)NCc1ccc(cc1)C(=O)NCCN(Cc1ccccc1)Cc1ccccc1
: