Target
Kappa-type opioid receptor
Ligand
BDBM71595
Substrate
Meas. Tech.
SAR analysis of Antagonists of the Kappa Opioid Receptor (KOR) using an Image-Based Assay - Set 3
IC50
>32000±n/a nM
Citation
 PubChem, PC SAR analysis of Antagonists of the Kappa Opioid Receptor (KOR) using an Image-Based Assay - Set 3 PubChem Bioassay (2010)[AID] 
Target
Name:
Kappa-type opioid receptor
Synonyms:
K-OR-1 Kappa-opioid receptor (KOR) Kappa-type opioid receptor (KOR) OPIATE Kappa OPRK1 kappa opioid receptor (KOR)
Type:
G Protein-Coupled Receptor (GPCR)
Mol. Mass.:
42648.76
Organism:
Homo sapiens (Human)
Description:
P41145
Residue:
380
  
Inhibitor
Name:
BDBM71595
Synonyms:
2-(4-oxidanylidenepyrrolo[1,2-a]quinoxalin-5-yl)-N-[3-[4-(phenylmethyl)piperazin-1-yl]propyl]ethanamide KSC-1-177 N-[3-(4-benzylpiperazin-1-yl)propyl]-2-(4-oxopyrrolo[1,2-a]quinoxalin-5-yl)acetamide cid_22522557
Type:
Small organic molecule
Emp. Form.:
C27H31N5O2
Mol. Mass.:
457.5673
SMILES:
O=C(Cn1c2ccccc2n2cccc2c1=O)NCCCN1CCN(Cc2ccccc2)CC1
: