Target
Kappa-type opioid receptor
Ligand
BDBM71596
Substrate
Meas. Tech.
SAR analysis of Antagonists of the Kappa Opioid Receptor (KOR) using an Image-Based Assay - Set 3
IC50
14600±n/a nM
Citation
 PubChem, PC SAR analysis of Antagonists of the Kappa Opioid Receptor (KOR) using an Image-Based Assay - Set 3 PubChem Bioassay (2010)[AID] 
Target
Name:
Kappa-type opioid receptor
Synonyms:
K-OR-1 Kappa-opioid receptor (KOR) Kappa-type opioid receptor (KOR) OPIATE Kappa OPRK1 kappa opioid receptor (KOR)
Type:
G Protein-Coupled Receptor (GPCR)
Mol. Mass.:
42648.76
Organism:
Homo sapiens (Human)
Description:
P41145
Residue:
380
  
Inhibitor
Name:
BDBM71596
Synonyms:
2-(7-fluoranyl-4-oxidanylidene-pyrrolo[1,2-a]quinoxalin-5-yl)-N-[3-[4-(4-fluorophenyl)piperazin-1-yl]propyl]ethanamide 2-(7-fluoro-4-oxo-5-pyrrolo[1,2-a]quinoxalinyl)-N-[3-[4-(4-fluorophenyl)-1-piperazinyl]propyl]acetamide KSC-1-178 cid_22522715
Type:
Small organic molecule
Emp. Form.:
C26H27F2N5O2
Mol. Mass.:
479.5217
SMILES:
Fc1ccc(cc1)N1CCN(CCCNC(=O)Cn2c3cc(F)ccc3n3cccc3c2=O)CC1
: