Target
Vacuolar aminopeptidase 1
Ligand
BDBM69506
Substrate
Meas. Tech.
Confirmatory Cherry Pick 3 SAR Dose Response Multiplex in TOR pathway GFP-fusion proteins for Saccharomyes cerevisiae, specifically LAP4
EC50
35850±n/a nM
Citation
 PubChem, PC Confirmatory Cherry Pick 3 SAR Dose Response Multiplex in TOR pathway GFP-fusion proteins for Saccharomyes cerevisiae, specifically LAP4 PubChem Bioassay (2011)[AID] 
Target
Name:
Vacuolar aminopeptidase 1
Synonyms:
AMPL_YEAST API YSC1
Type:
Enzyme Catalytic Domain
Mol. Mass.:
57084.90
Organism:
Saccharomyces cerevisiae
Description:
gi_486173
Residue:
514
  
Inhibitor
Name:
BDBM69506
Synonyms:
2-N-butan-2-yl-4-N-(2-methoxyphenyl)-5-nitropyrimidine-2,4,6-triamine N-sec-Butyl-N'-(2-methoxy-phenyl)-5-nitro-pyrimidine-2,4,6-triamine N2-butan-2-yl-N4-(2-methoxyphenyl)-5-nitropyrimidine-2,4,6-triamine [4-amino-5-nitro-6-(o-anisidino)pyrimidin-2-yl]-sec-butyl-amine | cid_3786263
Type:
Small organic molecule
Emp. Form.:
C15H20N6O3
Mol. Mass.:
332.3577
SMILES:
CCC(C)Nc1nc(N)c(c(Nc2ccccc2OC)n1)[N+]([O-])=O
: