Target
Delta-type opioid receptor
Ligand
BDBM75375
Substrate
Meas. Tech.
SAR Analysis of Agonists of the DOR Receptor using an Image-Based Assay - Set 3
EC50
>64000±n/a nM
Citation
 PubChem, PC SAR Analysis of Agonists of the DOR Receptor using an Image-Based Assay - Set 3 PubChem Bioassay (2010)[AID] 
Target
Name:
Delta-type opioid receptor
Synonyms:
D-OR-1 Delta opioid receptor OPIATE Delta OPRD1 OPRK1 | opioid receptor, delta 1
Type:
G Protein-Coupled Receptor (GPCR)
Mol. Mass.:
40382.98
Organism:
Homo sapiens (Human)
Description:
Competition binding assays were carried out using membrane preparations from transfected HN9.10 cells that constitutively expressed the delta opioid receptor.
Residue:
372
  
Inhibitor
Name:
BDBM75375
Synonyms:
2-[4-(2-furanylmethyl)-5-[[4-(trifluoromethyl)phenyl]methylthio]-1,2,4-triazol-3-yl]pyridine 2-[4-(furan-2-ylmethyl)-5-[[4-(trifluoromethyl)phenyl]methylsulfanyl]-1,2,4-triazol-3-yl]pyridine KUC104178N | cid_44620937
Type:
Small organic molecule
Emp. Form.:
C20H15F3N4OS
Mol. Mass.:
416.42
SMILES:
FC(F)(F)c1ccc(CSc2nnc(-c3ccccn3)n2Cc2ccco2)cc1
: