Target
Delta-type opioid receptor
Ligand
BDBM75387
Substrate
Meas. Tech.
SAR Analysis of Agonists of the DOR Receptor using an Image-Based Assay - Set 3
EC50
>64000±n/a nM
Citation
 PubChem, PC SAR Analysis of Agonists of the DOR Receptor using an Image-Based Assay - Set 3 PubChem Bioassay (2010)[AID] 
Target
Name:
Delta-type opioid receptor
Synonyms:
D-OR-1 Delta opioid receptor OPIATE Delta OPRD1 OPRK1 | opioid receptor, delta 1
Type:
G Protein-Coupled Receptor (GPCR)
Mol. Mass.:
40382.98
Organism:
Homo sapiens (Human)
Description:
Competition binding assays were carried out using membrane preparations from transfected HN9.10 cells that constitutively expressed the delta opioid receptor.
Residue:
372
  
Inhibitor
Name:
BDBM75387
Synonyms:
2-[5-[[4-chloranyl-3-(trifluoromethyl)phenyl]methylsulfanyl]-4-(furan-2-ylmethyl)-1,2,4-triazol-3-yl]pyridine 2-[5-[[4-chloro-3-(trifluoromethyl)phenyl]methylsulfanyl]-4-(furan-2-ylmethyl)-1,2,4-triazol-3-yl]pyridine KSC-5-287C3 cid_44620914
Type:
Small organic molecule
Emp. Form.:
C20H14ClF3N4OS
Mol. Mass.:
450.865
SMILES:
FC(F)(F)c1cc(CSc2nnc(-c3ccccn3)n2Cc2ccco2)ccc1Cl
: