Target
Kappa-type opioid receptor
Ligand
BDBM75558
Substrate
Meas. Tech.
SAR analysis of small molecule antagonists of the kappa opioid receptor via a luminescent beta-arrestin assay - Set 5
IC50
452±n/a nM
Citation
 PubChem, PC SAR analysis of small molecule antagonists of the kappa opioid receptor via a luminescent beta-arrestin assay - Set 5 PubChem Bioassay (2010)[AID] 
Target
Name:
Kappa-type opioid receptor
Synonyms:
K-OR-1 Kappa-opioid receptor (KOR) Kappa-type opioid receptor (KOR) OPIATE Kappa OPRK1 kappa opioid receptor (KOR)
Type:
G Protein-Coupled Receptor (GPCR)
Mol. Mass.:
42648.76
Organism:
Homo sapiens (Human)
Description:
P41145
Residue:
380
  
Inhibitor
Name:
BDBM75558
Synonyms:
4-[(benzylsulfonylamino)methyl]-N-[2-[(4-methoxyphenyl)methyl-propan-2-ylamino]ethyl]benzamide KSC-11-77-1 N-[2-[(4-methoxyphenyl)methyl-propan-2-yl-amino]ethyl]-4-[[(phenylmethyl)sulfonylamino]methyl]benzamide cid_44968272
Type:
Small organic molecule
Emp. Form.:
C28H35N3O4S
Mol. Mass.:
509.66
SMILES:
COc1ccc(CN(CCNC(=O)c2ccc(CNS(=O)(=O)Cc3ccccc3)cc2)C(C)C)cc1
: