Target
Kappa-type opioid receptor
Ligand
BDBM75564
Substrate
Meas. Tech.
SAR analysis of small molecule antagonists of the kappa opioid receptor via a luminescent beta-arrestin assay - Set 5
IC50
3860±n/a nM
Citation
 PubChem, PC SAR analysis of small molecule antagonists of the kappa opioid receptor via a luminescent beta-arrestin assay - Set 5 PubChem Bioassay (2010)[AID] 
Target
Name:
Kappa-type opioid receptor
Synonyms:
K-OR-1 Kappa-opioid receptor (KOR) Kappa-type opioid receptor (KOR) OPIATE Kappa OPRK1 kappa opioid receptor (KOR)
Type:
G Protein-Coupled Receptor (GPCR)
Mol. Mass.:
42648.76
Organism:
Homo sapiens (Human)
Description:
P41145
Residue:
380
  
Inhibitor
Name:
BDBM75564
Synonyms:
KSC-1-274 cid_44968273
Type:
Small organic molecule
Emp. Form.:
C26H29BrN6O2
Mol. Mass.:
537.451
SMILES:
Cc1ccc(cc1)N1CCN(CCCNC(=O)Cn2c3ncc(Br)cc3n3cccc3c2=O)CC1
: