Target
Delta-type opioid receptor
Ligand
BDBM71594
Substrate
Meas. Tech.
SAR Analysis of Antagonists of the DOR Receptor using an Image-Based Assay - Set 3
IC50
>32000±n/a nM
Citation
 PubChem, PC SAR Analysis of Antagonists of the DOR Receptor using an Image-Based Assay - Set 3 PubChem Bioassay (2010)[AID] 
Target
Name:
Delta-type opioid receptor
Synonyms:
D-OR-1 Delta opioid receptor OPIATE Delta OPRD1 OPRK1 | opioid receptor, delta 1
Type:
G Protein-Coupled Receptor (GPCR)
Mol. Mass.:
40382.98
Organism:
Homo sapiens (Human)
Description:
Competition binding assays were carried out using membrane preparations from transfected HN9.10 cells that constitutively expressed the delta opioid receptor.
Residue:
372
  
Inhibitor
Name:
BDBM71594
Synonyms:
4-[[(4-bromophenyl)sulfonylamino]methyl]-N-[2-[ethyl-(phenylmethyl)amino]ethyl]benzamide KUC104175N N-[2-[benzyl(ethyl)amino]ethyl]-4-[[(4-bromophenyl)sulfonylamino]methyl]benzamide | cid_44620906
Type:
Small organic molecule
Emp. Form.:
C25H28BrN3O3S
Mol. Mass.:
530.477
SMILES:
CCN(CCNC(=O)c1ccc(CNS(=O)(=O)c2ccc(Br)cc2)cc1)Cc1ccccc1
: